{"text_format":"2","workbook":"xlsx","n_sheets":4,"sheets":["Input and Output","Calculation","Lin_parameters_wd","Lin_parameters_wknd"],"not_rendered":{"charts":1,"images":6,"macros":0,"external_links":0,"defined_names":0,"comments":0,"pivot_tables":0},"unopened":[],"bounds":{"document_bytes":16777216,"sheet_cells":100000,"run_cost":"one","rows_first":2000,"rows_last":500,"rows_between":2000,"halvings":0,"cell_chars":16384,"cell_head_chars":4096},"cells_cut":0,"cells_raw":0,"read":"whole","date_system":"1900"}

{"sheet":"Input and Output","index":0,"n_rows":400,"n_cols":6,"rows_kept":400,"cut":false,"hidden":false,"merged":[[32,1,32,2],[32,4,32,10],[6,1,6,8],[26,1,26,2],[7,1,24,8]]}
[]
[]
[]
[]
[]
[]
[null,"This tool was developed within Subtask A \"Integrated Energy System\" of IEA SHC Task 64 \"Solar Process Heat\". The underlying database and methodology is described in the Deliverable D.A1 \"Reference applications for renewable heat\". \nIt can be used to define an annual heat load profile with a daily resolution for industrial consumers. "]
[null,"How to use this tool? \nEnter all required information to the yellow marked cells. Choose from four possible clusters for working days (wd) and five possible clusters \nfor weekends and holidays (wknd). The respective location can be chosen by inserting an annual ambient temperature profile. The dependency of daily heat demand on ambient temperature is increasing from clusters 0 to 3 or 0 to 4 (see Figure 1)."]
{"$rows_empty":18}
[null,"Enter load profile parameters."]
[null,"wd cluster",2]
[null,"wknd cluster",3]
[null,"Qyear [MWh/a]",300]
[null,"Year",2016]
[]
[null,"Enter an annual ambient \ntemperature profile.",null,null,"Results"]
[null,"Day","Mean daily ambient temperature \nin °C",null,"Qnorm,day \nin -","Qday \nin MWh/d"]
[null,{"$f":"Calculation!A2","v":"2016-01-01"},4.5999999999999996,null,{"$f":"Calculation!K2","v":0.96481799206354169},{"$f":"Calculation!L2","v":1.0361573344246957}]
[null,{"$f":"Calculation!A3","v":"2016-01-02"},1.8,null,{"$f":"Calculation!K3","v":1.1756881350781208},{"$f":"Calculation!L3","v":1.2626193688115408}]
[null,{"$f":"Calculation!A4","v":"2016-01-03"},0.7,null,{"$f":"Calculation!K4","v":1.7047494869148603},{"$f":"Calculation!L4","v":1.8307999008659002}]
[null,{"$f":"Calculation!A5","v":"2016-01-04"},0.1,null,{"$f":"Calculation!K5","v":1.762340338835005},{"$f":"Calculation!L5","v":1.8926490621623187}]
[null,{"$f":"Calculation!A6","v":"2016-01-05"},3.8,null,{"$f":"Calculation!K6","v":1.4071967519941131},{"$f":"Calculation!L6","v":1.5112459008344059}]
[null,{"$f":"Calculation!A7","v":"2016-01-06"},1.8,null,{"$f":"Calculation!K7","v":1.5991662583945951},{"$f":"Calculation!L7","v":1.7174097718224668}]
[null,{"$f":"Calculation!A8","v":"2016-01-07"},3.1,null,{"$f":"Calculation!K8","v":1.4743860792342818},{"$f":"Calculation!L8","v":1.5834032556802271}]
[null,{"$f":"Calculation!A9","v":"2016-01-08"},4.3,null,{"$f":"Calculation!K9","v":0.9874112216722466},{"$f":"Calculation!L9","v":1.0604211238232861}]
[null,{"$f":"Calculation!A10","v":"2016-01-09"},1,null,{"$f":"Calculation!K10","v":1.2359367473680003},{"$f":"Calculation!L10","v":1.3273228072077818}]
[null,{"$f":"Calculation!A11","v":"2016-01-10"},5.6,null,{"$f":"Calculation!K11","v":1.2344241962336793},{"$f":"Calculation!L11","v":1.3256984169451509}]
[null,{"$f":"Calculation!A12","v":"2016-01-11"},4.5,null,{"$f":"Calculation!K12","v":1.3400074247539444},{"$f":"Calculation!L12","v":1.4390885459885845}]
[null,{"$f":"Calculation!A13","v":"2016-01-12"},4.8,null,{"$f":"Calculation!K13","v":1.3112119987938722},{"$f":"Calculation!L13","v":1.4081639653403755}]
[null,{"$f":"Calculation!A14","v":"2016-01-13"},3.8,null,{"$f":"Calculation!K14","v":1.4071967519941131},{"$f":"Calculation!L14","v":1.5112459008344059}]
{"$rows_left_out":354}
{"sheet":"Calculation","index":1,"n_rows":367,"n_cols":12,"rows_kept":367,"cut":false,"hidden":false,"merged":[]}
["Date","Mean daily ambient Temperature in °C","Weekday","b_h","m_h","b_w","m_w","t_hl","b","m","Qnorm,day in -","Qday in MWh/d"]
[{"$f":"DATE('Input and Output'!$C$31,1,1)","v":"2016-01-01"},{"$f":"'Input and Output'!C35","v":4.5999999999999996},{"$f":"WEEKDAY(A2)","v":6},{"$f":"IF($C2<6,Lin_parameters_wd!B$9,Lin_parameters_wknd!B$10)","v":1.31124751273035},{"$f":"IF($C2<6,Lin_parameters_wd!C$9,Lin_parameters_wknd!C$10)","v":-7.5310765362349638E-2},{"$f":"IF($C2<6,Lin_parameters_wd!D$9,Lin_parameters_wknd!D$10)","v":0.29524473618599389},{"$f":"IF($C2<6,Lin_parameters_wd!E$9,Lin_parameters_wknd!E$10)","v":-9.762199133681506E-3},{"$f":"IF($C2<6,Lin_parameters_wd!F$9,Lin_parameters_wknd!F$10)","v":15.5},{"$f":"IF($B2<$H2,$D2,$F2)","v":1.31124751273035},{"$f":"IF($B2<$H2,$E2,$G2)","v":-7.5310765362349638E-2},{"$f":"MAX($I2+$J2*$B2,0)","v":0.96481799206354169},{"$f":"$K2*'Input and Output'!$C$30/SUM($K$2:$K$366)","v":1.0361573344246957}]
[{"$f":"A2+1","v":"2016-01-02"},{"$f":"'Input and Output'!C36","v":1.8},7,{"$f":"IF($C3<6,Lin_parameters_wd!B$9,Lin_parameters_wknd!B$10)","v":1.31124751273035},{"$f":"IF($C3<6,Lin_parameters_wd!C$9,Lin_parameters_wknd!C$10)","v":-7.5310765362349638E-2},{"$f":"IF($C3<6,Lin_parameters_wd!D$9,Lin_parameters_wknd!D$10)","v":0.29524473618599389},{"$f":"IF($C3<6,Lin_parameters_wd!E$9,Lin_parameters_wknd!E$10)","v":-9.762199133681506E-3},{"$f":"IF($C3<6,Lin_parameters_wd!F$9,Lin_parameters_wknd!F$10)","v":15.5},{"$f":"IF($B3<$H3,$D3,$F3)","v":1.31124751273035},{"$f":"IF($B3<$H3,$E3,$G3)","v":-7.5310765362349638E-2},{"$f":"MAX($I3+$J3*$B3,0)","v":1.1756881350781208},{"$f":"$K3*'Input and Output'!$C$30/SUM($K$2:$K$366)","v":1.2626193688115408}]
[{"$f":"A3+1","v":"2016-01-03"},{"$f":"'Input and Output'!C37","v":0.7},1,{"$f":"IF($C4<6,Lin_parameters_wd!B$9,Lin_parameters_wknd!B$10)","v":1.771938814155029},{"$f":"IF($C4<6,Lin_parameters_wd!C$9,Lin_parameters_wknd!C$10)","v":-9.5984753200240996E-2},{"$f":"IF($C4<6,Lin_parameters_wd!D$9,Lin_parameters_wknd!D$10)","v":0.40699471377216029},{"$f":"IF($C4<6,Lin_parameters_wd!E$9,Lin_parameters_wknd!E$10)","v":-1.2756454396407539E-2},{"$f":"IF($C4<6,Lin_parameters_wd!F$9,Lin_parameters_wknd!F$10)","v":16.399999999999999},1.771938814155029,-9.5984753200240996E-2,1.7047494869148603,{"$f":"$K4*'Input and Output'!$C$30/SUM($K$2:$K$366)","v":1.8307999008659002}]
["2016-01-04",{"$f":"'Input and Output'!C38","v":0.1},2,{"$f":"IF($C5<6,Lin_parameters_wd!B$9,Lin_parameters_wknd!B$10)","v":1.771938814155029},{"$f":"IF($C5<6,Lin_parameters_wd!C$9,Lin_parameters_wknd!C$10)","v":-9.5984753200240996E-2},{"$f":"IF($C5<6,Lin_parameters_wd!D$9,Lin_parameters_wknd!D$10)","v":0.40699471377216029},{"$f":"IF($C5<6,Lin_parameters_wd!E$9,Lin_parameters_wknd!E$10)","v":-1.2756454396407539E-2},{"$f":"IF($C5<6,Lin_parameters_wd!F$9,Lin_parameters_wknd!F$10)","v":16.399999999999999},1.771938814155029,-9.5984753200240996E-2,1.762340338835005,{"$f":"$K5*'Input and Output'!$C$30/SUM($K$2:$K$366)","v":1.8926490621623187}]
["2016-01-05",{"$f":"'Input and Output'!C39","v":3.8},3,{"$f":"IF($C6<6,Lin_parameters_wd!B$9,Lin_parameters_wknd!B$10)","v":1.771938814155029},{"$f":"IF($C6<6,Lin_parameters_wd!C$9,Lin_parameters_wknd!C$10)","v":-9.5984753200240996E-2},{"$f":"IF($C6<6,Lin_parameters_wd!D$9,Lin_parameters_wknd!D$10)","v":0.40699471377216029},{"$f":"IF($C6<6,Lin_parameters_wd!E$9,Lin_parameters_wknd!E$10)","v":-1.2756454396407539E-2},{"$f":"IF($C6<6,Lin_parameters_wd!F$9,Lin_parameters_wknd!F$10)","v":16.399999999999999},1.771938814155029,-9.5984753200240996E-2,1.4071967519941131,{"$f":"$K6*'Input and Output'!$C$30/SUM($K$2:$K$366)","v":1.5112459008344059}]
["2016-01-06",{"$f":"'Input and Output'!C40","v":1.8},4,{"$f":"IF($C7<6,Lin_parameters_wd!B$9,Lin_parameters_wknd!B$10)","v":1.771938814155029},{"$f":"IF($C7<6,Lin_parameters_wd!C$9,Lin_parameters_wknd!C$10)","v":-9.5984753200240996E-2},{"$f":"IF($C7<6,Lin_parameters_wd!D$9,Lin_parameters_wknd!D$10)","v":0.40699471377216029},{"$f":"IF($C7<6,Lin_parameters_wd!E$9,Lin_parameters_wknd!E$10)","v":-1.2756454396407539E-2},{"$f":"IF($C7<6,Lin_parameters_wd!F$9,Lin_parameters_wknd!F$10)","v":16.399999999999999},1.771938814155029,-9.5984753200240996E-2,1.5991662583945951,{"$f":"$K7*'Input and Output'!$C$30/SUM($K$2:$K$366)","v":1.7174097718224668}]
["2016-01-07",{"$f":"'Input and Output'!C41","v":3.1},5,{"$f":"IF($C8<6,Lin_parameters_wd!B$9,Lin_parameters_wknd!B$10)","v":1.771938814155029},{"$f":"IF($C8<6,Lin_parameters_wd!C$9,Lin_parameters_wknd!C$10)","v":-9.5984753200240996E-2},{"$f":"IF($C8<6,Lin_parameters_wd!D$9,Lin_parameters_wknd!D$10)","v":0.40699471377216029},{"$f":"IF($C8<6,Lin_parameters_wd!E$9,Lin_parameters_wknd!E$10)","v":-1.2756454396407539E-2},{"$f":"IF($C8<6,Lin_parameters_wd!F$9,Lin_parameters_wknd!F$10)","v":16.399999999999999},1.771938814155029,-9.5984753200240996E-2,1.4743860792342818,{"$f":"$K8*'Input and Output'!$C$30/SUM($K$2:$K$366)","v":1.5834032556802271}]
["2016-01-08",{"$f":"'Input and Output'!C42","v":4.3},6,{"$f":"IF($C9<6,Lin_parameters_wd!B$9,Lin_parameters_wknd!B$10)","v":1.31124751273035},{"$f":"IF($C9<6,Lin_parameters_wd!C$9,Lin_parameters_wknd!C$10)","v":-7.5310765362349638E-2},{"$f":"IF($C9<6,Lin_parameters_wd!D$9,Lin_parameters_wknd!D$10)","v":0.29524473618599389},{"$f":"IF($C9<6,Lin_parameters_wd!E$9,Lin_parameters_wknd!E$10)","v":-9.762199133681506E-3},{"$f":"IF($C9<6,Lin_parameters_wd!F$9,Lin_parameters_wknd!F$10)","v":15.5},1.31124751273035,-7.5310765362349638E-2,0.9874112216722466,{"$f":"$K9*'Input and Output'!$C$30/SUM($K$2:$K$366)","v":1.0604211238232861}]
["2016-01-09",{"$f":"'Input and Output'!C43","v":1},7,{"$f":"IF($C10<6,Lin_parameters_wd!B$9,Lin_parameters_wknd!B$10)","v":1.31124751273035},{"$f":"IF($C10<6,Lin_parameters_wd!C$9,Lin_parameters_wknd!C$10)","v":-7.5310765362349638E-2},{"$f":"IF($C10<6,Lin_parameters_wd!D$9,Lin_parameters_wknd!D$10)","v":0.29524473618599389},{"$f":"IF($C10<6,Lin_parameters_wd!E$9,Lin_parameters_wknd!E$10)","v":-9.762199133681506E-3},{"$f":"IF($C10<6,Lin_parameters_wd!F$9,Lin_parameters_wknd!F$10)","v":15.5},1.31124751273035,-7.5310765362349638E-2,1.2359367473680003,{"$f":"$K10*'Input and Output'!$C$30/SUM($K$2:$K$366)","v":1.3273228072077818}]
["2016-01-10",{"$f":"'Input and Output'!C44","v":5.6},1,{"$f":"IF($C11<6,Lin_parameters_wd!B$9,Lin_parameters_wknd!B$10)","v":1.771938814155029},{"$f":"IF($C11<6,Lin_parameters_wd!C$9,Lin_parameters_wknd!C$10)","v":-9.5984753200240996E-2},{"$f":"IF($C11<6,Lin_parameters_wd!D$9,Lin_parameters_wknd!D$10)","v":0.40699471377216029},{"$f":"IF($C11<6,Lin_parameters_wd!E$9,Lin_parameters_wknd!E$10)","v":-1.2756454396407539E-2},{"$f":"IF($C11<6,Lin_parameters_wd!F$9,Lin_parameters_wknd!F$10)","v":16.399999999999999},1.771938814155029,-9.5984753200240996E-2,1.2344241962336793,{"$f":"$K11*'Input and Output'!$C$30/SUM($K$2:$K$366)","v":1.3256984169451509}]
["2016-01-11",{"$f":"'Input and Output'!C45","v":4.5},2,{"$f":"IF($C12<6,Lin_parameters_wd!B$9,Lin_parameters_wknd!B$10)","v":1.771938814155029},{"$f":"IF($C12<6,Lin_parameters_wd!C$9,Lin_parameters_wknd!C$10)","v":-9.5984753200240996E-2},{"$f":"IF($C12<6,Lin_parameters_wd!D$9,Lin_parameters_wknd!D$10)","v":0.40699471377216029},{"$f":"IF($C12<6,Lin_parameters_wd!E$9,Lin_parameters_wknd!E$10)","v":-1.2756454396407539E-2},{"$f":"IF($C12<6,Lin_parameters_wd!F$9,Lin_parameters_wknd!F$10)","v":16.399999999999999},1.771938814155029,-9.5984753200240996E-2,1.3400074247539444,{"$f":"$K12*'Input and Output'!$C$30/SUM($K$2:$K$366)","v":1.4390885459885845}]
["2016-01-12",{"$f":"'Input and Output'!C46","v":4.8},3,{"$f":"IF($C13<6,Lin_parameters_wd!B$9,Lin_parameters_wknd!B$10)","v":1.771938814155029},{"$f":"IF($C13<6,Lin_parameters_wd!C$9,Lin_parameters_wknd!C$10)","v":-9.5984753200240996E-2},{"$f":"IF($C13<6,Lin_parameters_wd!D$9,Lin_parameters_wknd!D$10)","v":0.40699471377216029},{"$f":"IF($C13<6,Lin_parameters_wd!E$9,Lin_parameters_wknd!E$10)","v":-1.2756454396407539E-2},{"$f":"IF($C13<6,Lin_parameters_wd!F$9,Lin_parameters_wknd!F$10)","v":16.399999999999999},1.771938814155029,-9.5984753200240996E-2,1.3112119987938722,{"$f":"$K13*'Input and Output'!$C$30/SUM($K$2:$K$366)","v":1.4081639653403755}]
["2016-01-13",{"$f":"'Input and Output'!C47","v":3.8},4,{"$f":"IF($C14<6,Lin_parameters_wd!B$9,Lin_parameters_wknd!B$10)","v":1.771938814155029},{"$f":"IF($C14<6,Lin_parameters_wd!C$9,Lin_parameters_wknd!C$10)","v":-9.5984753200240996E-2},{"$f":"IF($C14<6,Lin_parameters_wd!D$9,Lin_parameters_wknd!D$10)","v":0.40699471377216029},{"$f":"IF($C14<6,Lin_parameters_wd!E$9,Lin_parameters_wknd!E$10)","v":-1.2756454396407539E-2},{"$f":"IF($C14<6,Lin_parameters_wd!F$9,Lin_parameters_wknd!F$10)","v":16.399999999999999},1.771938814155029,-9.5984753200240996E-2,1.4071967519941131,{"$f":"$K14*'Input and Output'!$C$30/SUM($K$2:$K$366)","v":1.5112459008344059}]
["2016-01-14",{"$f":"'Input and Output'!C48","v":2},5,{"$f":"IF($C15<6,Lin_parameters_wd!B$9,Lin_parameters_wknd!B$10)","v":1.771938814155029},{"$f":"IF($C15<6,Lin_parameters_wd!C$9,Lin_parameters_wknd!C$10)","v":-9.5984753200240996E-2},{"$f":"IF($C15<6,Lin_parameters_wd!D$9,Lin_parameters_wknd!D$10)","v":0.40699471377216029},{"$f":"IF($C15<6,Lin_parameters_wd!E$9,Lin_parameters_wknd!E$10)","v":-1.2756454396407539E-2},{"$f":"IF($C15<6,Lin_parameters_wd!F$9,Lin_parameters_wknd!F$10)","v":16.399999999999999},1.771938814155029,-9.5984753200240996E-2,1.5799693077545469,{"$f":"$K15*'Input and Output'!$C$30/SUM($K$2:$K$366)","v":1.6967933847236607}]
["2016-01-15",{"$f":"'Input and Output'!C49","v":1.5},6,{"$f":"IF($C16<6,Lin_parameters_wd!B$9,Lin_parameters_wknd!B$10)","v":1.31124751273035},{"$f":"IF($C16<6,Lin_parameters_wd!C$9,Lin_parameters_wknd!C$10)","v":-7.5310765362349638E-2},{"$f":"IF($C16<6,Lin_parameters_wd!D$9,Lin_parameters_wknd!D$10)","v":0.29524473618599389},{"$f":"IF($C16<6,Lin_parameters_wd!E$9,Lin_parameters_wknd!E$10)","v":-9.762199133681506E-3},{"$f":"IF($C16<6,Lin_parameters_wd!F$9,Lin_parameters_wknd!F$10)","v":15.5},1.31124751273035,-7.5310765362349638E-2,1.1982813646868256,{"$f":"$K16*'Input and Output'!$C$30/SUM($K$2:$K$366)","v":1.2868831582101312}]
["2016-01-16",{"$f":"'Input and Output'!C50","v":0.4},7,{"$f":"IF($C17<6,Lin_parameters_wd!B$9,Lin_parameters_wknd!B$10)","v":1.31124751273035},{"$f":"IF($C17<6,Lin_parameters_wd!C$9,Lin_parameters_wknd!C$10)","v":-7.5310765362349638E-2},{"$f":"IF($C17<6,Lin_parameters_wd!D$9,Lin_parameters_wknd!D$10)","v":0.29524473618599389},{"$f":"IF($C17<6,Lin_parameters_wd!E$9,Lin_parameters_wknd!E$10)","v":-9.762199133681506E-3},{"$f":"IF($C17<6,Lin_parameters_wd!F$9,Lin_parameters_wknd!F$10)","v":15.5},1.31124751273035,-7.5310765362349638E-2,1.2811232065854101,{"$f":"$K17*'Input and Output'!$C$30/SUM($K$2:$K$366)","v":1.3758503860049629}]
["2016-01-17",{"$f":"'Input and Output'!C51","v":-1.6},1,{"$f":"IF($C18<6,Lin_parameters_wd!B$9,Lin_parameters_wknd!B$10)","v":1.771938814155029},{"$f":"IF($C18<6,Lin_parameters_wd!C$9,Lin_parameters_wknd!C$10)","v":-9.5984753200240996E-2},{"$f":"IF($C18<6,Lin_parameters_wd!D$9,Lin_parameters_wknd!D$10)","v":0.40699471377216029},{"$f":"IF($C18<6,Lin_parameters_wd!E$9,Lin_parameters_wknd!E$10)","v":-1.2756454396407539E-2},{"$f":"IF($C18<6,Lin_parameters_wd!F$9,Lin_parameters_wknd!F$10)","v":16.399999999999999},1.771938814155029,-9.5984753200240996E-2,1.9255144192754146,{"$f":"$K18*'Input and Output'!$C$30/SUM($K$2:$K$366)","v":2.0678883525021705}]
["2016-01-18",{"$f":"'Input and Output'!C52","v":-5.3},2,{"$f":"IF($C19<6,Lin_parameters_wd!B$9,Lin_parameters_wknd!B$10)","v":1.771938814155029},{"$f":"IF($C19<6,Lin_parameters_wd!C$9,Lin_parameters_wknd!C$10)","v":-9.5984753200240996E-2},{"$f":"IF($C19<6,Lin_parameters_wd!D$9,Lin_parameters_wknd!D$10)","v":0.40699471377216029},{"$f":"IF($C19<6,Lin_parameters_wd!E$9,Lin_parameters_wknd!E$10)","v":-1.2756454396407539E-2},{"$f":"IF($C19<6,Lin_parameters_wd!F$9,Lin_parameters_wknd!F$10)","v":16.399999999999999},1.771938814155029,-9.5984753200240996E-2,2.2806580061163064,{"$f":"$K19*'Input and Output'!$C$30/SUM($K$2:$K$366)","v":2.449291513830083}]
["2016-01-19",{"$f":"'Input and Output'!C53","v":-7.3},3,{"$f":"IF($C20<6,Lin_parameters_wd!B$9,Lin_parameters_wknd!B$10)","v":1.771938814155029},{"$f":"IF($C20<6,Lin_parameters_wd!C$9,Lin_parameters_wknd!C$10)","v":-9.5984753200240996E-2},{"$f":"IF($C20<6,Lin_parameters_wd!D$9,Lin_parameters_wknd!D$10)","v":0.40699471377216029},{"$f":"IF($C20<6,Lin_parameters_wd!E$9,Lin_parameters_wknd!E$10)","v":-1.2756454396407539E-2},{"$f":"IF($C20<6,Lin_parameters_wd!F$9,Lin_parameters_wknd!F$10)","v":16.399999999999999},1.771938814155029,-9.5984753200240996E-2,2.4726275125167883,{"$f":"$K20*'Input and Output'!$C$30/SUM($K$2:$K$366)","v":2.6554553848181439}]
["2016-01-20",{"$f":"'Input and Output'!C54","v":-3.3},4,{"$f":"IF($C21<6,Lin_parameters_wd!B$9,Lin_parameters_wknd!B$10)","v":1.771938814155029},{"$f":"IF($C21<6,Lin_parameters_wd!C$9,Lin_parameters_wknd!C$10)","v":-9.5984753200240996E-2},{"$f":"IF($C21<6,Lin_parameters_wd!D$9,Lin_parameters_wknd!D$10)","v":0.40699471377216029},{"$f":"IF($C21<6,Lin_parameters_wd!E$9,Lin_parameters_wknd!E$10)","v":-1.2756454396407539E-2},{"$f":"IF($C21<6,Lin_parameters_wd!F$9,Lin_parameters_wknd!F$10)","v":16.399999999999999},1.771938814155029,-9.5984753200240996E-2,2.0886884997158242,{"$f":"$K21*'Input and Output'!$C$30/SUM($K$2:$K$366)","v":2.2431276428420217}]
["2016-01-21",{"$f":"'Input and Output'!C55","v":-4.2},5,{"$f":"IF($C22<6,Lin_parameters_wd!B$9,Lin_parameters_wknd!B$10)","v":1.771938814155029},{"$f":"IF($C22<6,Lin_parameters_wd!C$9,Lin_parameters_wknd!C$10)","v":-9.5984753200240996E-2},{"$f":"IF($C22<6,Lin_parameters_wd!D$9,Lin_parameters_wknd!D$10)","v":0.40699471377216029},{"$f":"IF($C22<6,Lin_parameters_wd!E$9,Lin_parameters_wknd!E$10)","v":-1.2756454396407539E-2},{"$f":"IF($C22<6,Lin_parameters_wd!F$9,Lin_parameters_wknd!F$10)","v":16.399999999999999},1.771938814155029,-9.5984753200240996E-2,2.1750747775960413,{"$f":"$K22*'Input and Output'!$C$30/SUM($K$2:$K$366)","v":2.3359013847866494}]
["2016-01-22",{"$f":"'Input and Output'!C56","v":-6.4},6,{"$f":"IF($C23<6,Lin_parameters_wd!B$9,Lin_parameters_wknd!B$10)","v":1.31124751273035},{"$f":"IF($C23<6,Lin_parameters_wd!C$9,Lin_parameters_wknd!C$10)","v":-7.5310765362349638E-2},{"$f":"IF($C23<6,Lin_parameters_wd!D$9,Lin_parameters_wknd!D$10)","v":0.29524473618599389},{"$f":"IF($C23<6,Lin_parameters_wd!E$9,Lin_parameters_wknd!E$10)","v":-9.762199133681506E-3},{"$f":"IF($C23<6,Lin_parameters_wd!F$9,Lin_parameters_wknd!F$10)","v":15.5},1.31124751273035,-7.5310765362349638E-2,1.7932364110493877,{"$f":"$K23*'Input and Output'!$C$30/SUM($K$2:$K$366)","v":1.9258296123730152}]
["2016-01-23",{"$f":"'Input and Output'!C57","v":1},7,{"$f":"IF($C24<6,Lin_parameters_wd!B$9,Lin_parameters_wknd!B$10)","v":1.31124751273035},{"$f":"IF($C24<6,Lin_parameters_wd!C$9,Lin_parameters_wknd!C$10)","v":-7.5310765362349638E-2},{"$f":"IF($C24<6,Lin_parameters_wd!D$9,Lin_parameters_wknd!D$10)","v":0.29524473618599389},{"$f":"IF($C24<6,Lin_parameters_wd!E$9,Lin_parameters_wknd!E$10)","v":-9.762199133681506E-3},{"$f":"IF($C24<6,Lin_parameters_wd!F$9,Lin_parameters_wknd!F$10)","v":15.5},1.31124751273035,-7.5310765362349638E-2,1.2359367473680003,{"$f":"$K24*'Input and Output'!$C$30/SUM($K$2:$K$366)","v":1.3273228072077818}]
["2016-01-24",{"$f":"'Input and Output'!C58","v":3.4},1,{"$f":"IF($C25<6,Lin_parameters_wd!B$9,Lin_parameters_wknd!B$10)","v":1.771938814155029},{"$f":"IF($C25<6,Lin_parameters_wd!C$9,Lin_parameters_wknd!C$10)","v":-9.5984753200240996E-2},{"$f":"IF($C25<6,Lin_parameters_wd!D$9,Lin_parameters_wknd!D$10)","v":0.40699471377216029},{"$f":"IF($C25<6,Lin_parameters_wd!E$9,Lin_parameters_wknd!E$10)","v":-1.2756454396407539E-2},{"$f":"IF($C25<6,Lin_parameters_wd!F$9,Lin_parameters_wknd!F$10)","v":16.399999999999999},1.771938814155029,-9.5984753200240996E-2,1.4455906532742095,{"$f":"$K25*'Input and Output'!$C$30/SUM($K$2:$K$366)","v":1.5524786750320181}]
["2016-01-25",{"$f":"'Input and Output'!C59","v":6.5},2,{"$f":"IF($C26<6,Lin_parameters_wd!B$9,Lin_parameters_wknd!B$10)","v":1.771938814155029},{"$f":"IF($C26<6,Lin_parameters_wd!C$9,Lin_parameters_wknd!C$10)","v":-9.5984753200240996E-2},{"$f":"IF($C26<6,Lin_parameters_wd!D$9,Lin_parameters_wknd!D$10)","v":0.40699471377216029},{"$f":"IF($C26<6,Lin_parameters_wd!E$9,Lin_parameters_wknd!E$10)","v":-1.2756454396407539E-2},{"$f":"IF($C26<6,Lin_parameters_wd!F$9,Lin_parameters_wknd!F$10)","v":16.399999999999999},1.771938814155029,-9.5984753200240996E-2,1.1480379183534626,{"$f":"$K26*'Input and Output'!$C$30/SUM($K$2:$K$366)","v":1.2329246750005238}]
["2016-01-26",{"$f":"'Input and Output'!C60","v":7.7},3,{"$f":"IF($C27<6,Lin_parameters_wd!B$9,Lin_parameters_wknd!B$10)","v":1.771938814155029},{"$f":"IF($C27<6,Lin_parameters_wd!C$9,Lin_parameters_wknd!C$10)","v":-9.5984753200240996E-2},{"$f":"IF($C27<6,Lin_parameters_wd!D$9,Lin_parameters_wknd!D$10)","v":0.40699471377216029},{"$f":"IF($C27<6,Lin_parameters_wd!E$9,Lin_parameters_wknd!E$10)","v":-1.2756454396407539E-2},{"$f":"IF($C27<6,Lin_parameters_wd!F$9,Lin_parameters_wknd!F$10)","v":16.399999999999999},1.771938814155029,-9.5984753200240996E-2,1.0328562145131732,{"$f":"$K27*'Input and Output'!$C$30/SUM($K$2:$K$366)","v":1.1092263524076871}]
["2016-01-27",{"$f":"'Input and Output'!C61","v":9.4},4,{"$f":"IF($C28<6,Lin_parameters_wd!B$9,Lin_parameters_wknd!B$10)","v":1.771938814155029},{"$f":"IF($C28<6,Lin_parameters_wd!C$9,Lin_parameters_wknd!C$10)","v":-9.5984753200240996E-2},{"$f":"IF($C28<6,Lin_parameters_wd!D$9,Lin_parameters_wknd!D$10)","v":0.40699471377216029},{"$f":"IF($C28<6,Lin_parameters_wd!E$9,Lin_parameters_wknd!E$10)","v":-1.2756454396407539E-2},{"$f":"IF($C28<6,Lin_parameters_wd!F$9,Lin_parameters_wknd!F$10)","v":16.399999999999999},1.771938814155029,-9.5984753200240996E-2,0.86968213407276351,{"$f":"$K28*'Input and Output'!$C$30/SUM($K$2:$K$366)","v":0.93398706206783522}]
["2016-01-28",{"$f":"'Input and Output'!C62","v":7.3},5,{"$f":"IF($C29<6,Lin_parameters_wd!B$9,Lin_parameters_wknd!B$10)","v":1.771938814155029},{"$f":"IF($C29<6,Lin_parameters_wd!C$9,Lin_parameters_wknd!C$10)","v":-9.5984753200240996E-2},{"$f":"IF($C29<6,Lin_parameters_wd!D$9,Lin_parameters_wknd!D$10)","v":0.40699471377216029},{"$f":"IF($C29<6,Lin_parameters_wd!E$9,Lin_parameters_wknd!E$10)","v":-1.2756454396407539E-2},{"$f":"IF($C29<6,Lin_parameters_wd!F$9,Lin_parameters_wknd!F$10)","v":16.399999999999999},1.771938814155029,-9.5984753200240996E-2,1.0712501157932697,{"$f":"$K29*'Input and Output'!$C$30/SUM($K$2:$K$366)","v":1.1504591266052995}]
["2016-01-29",{"$f":"'Input and Output'!C63","v":4.9000000000000004},6,{"$f":"IF($C30<6,Lin_parameters_wd!B$9,Lin_parameters_wknd!B$10)","v":1.31124751273035},{"$f":"IF($C30<6,Lin_parameters_wd!C$9,Lin_parameters_wknd!C$10)","v":-7.5310765362349638E-2},{"$f":"IF($C30<6,Lin_parameters_wd!D$9,Lin_parameters_wknd!D$10)","v":0.29524473618599389},{"$f":"IF($C30<6,Lin_parameters_wd!E$9,Lin_parameters_wknd!E$10)","v":-9.762199133681506E-3},{"$f":"IF($C30<6,Lin_parameters_wd!F$9,Lin_parameters_wknd!F$10)","v":15.5},1.31124751273035,-7.5310765362349638E-2,0.94222476245483677,{"$f":"$K30*'Input and Output'!$C$30/SUM($K$2:$K$366)","v":1.0118935450261051}]
{"$rows_left_out":338}
{"sheet":"Lin_parameters_wd","index":2,"n_rows":9,"n_cols":6,"rows_kept":9,"cut":false,"hidden":false,"merged":[[0,0,0,5],[6,0,6,5]]}
["Linear regregression paramaters for working days:"]
[null,"b_h","m_h","b_w","m_w","t_hl"]
[0,1.085192073005006,-1.544218835154681E-2,1.0609861866589789,-7.0953309908476907E-3,2.9]
[1,1.4695351264848711,-5.875924024232846E-2,0.67790786498212752,-1.3263420615734021E-2,17.399999999999999]
[2,1.771938814155029,-9.5984753200240996E-2,0.40699471377216029,-1.2756454396407539E-2,16.399999999999999]
[3,2.5404025087253199,-0.17801624965770491,0.52104102880341097,-2.1476600051355411E-2,12.9]
["Linear regression paramaters for selected working day cluster:"]
[null,"b_h","m_h","b_w","m_w","t_hl"]
[{"$f":"VLOOKUP('Input and Output'!$C$28,Lin_parameters_wd!$A$2:$F$6,1,FALSE)","v":2},{"$f":"VLOOKUP('Input and Output'!$C$28,Lin_parameters_wd!$A$2:$F$6,2,FALSE)","v":1.771938814155029},{"$f":"VLOOKUP('Input and Output'!$C$28,Lin_parameters_wd!$A$2:$F$6,3,FALSE)","v":-9.5984753200240996E-2},{"$f":"VLOOKUP('Input and Output'!$C$28,Lin_parameters_wd!$A$2:$F$6,4,FALSE)","v":0.40699471377216029},{"$f":"VLOOKUP('Input and Output'!$C$28,Lin_parameters_wd!$A$2:$F$6,5,FALSE)","v":-1.2756454396407539E-2},{"$f":"VLOOKUP('Input and Output'!$C$28,Lin_parameters_wd!$A$2:$F$6,6,FALSE)","v":16.399999999999999}]

{"sheet":"Lin_parameters_wknd","index":3,"n_rows":10,"n_cols":6,"rows_kept":10,"cut":false,"hidden":false,"merged":[[0,0,0,5],[7,0,7,5]]}
["Linear regregression paramaters for weekends and holidays:"]
[null,"b_h","m_h","b_w","m_w","t_hl"]
[0,0.88136675487947747,-1.236743869637378E-2,0.66609297291086311,-3.4097042997074749E-4,17.899999999999999]
[1,0.40529111994771311,-1.3226323007097701E-2,0.19607255136472959,-6.2279477920712143E-4,16.600000000000001]
[2,1.4791569663107089,-6.6119920832722404E-2,0.65274423464211173,-1.60343007315953E-2,16.5]
[3,1.31124751273035,-7.5310765362349638E-2,0.29524473618599389,-9.762199133681506E-3,15.5]
[4,1.9424956480203619,-0.1200596025795522,0.44487676601187343,-1.748296682554611E-2,14.6]
["Linear regression paramaters for selected weekend and holiday cluster:"]
[null,"b_h","m_h","b_w","m_w","t_hl"]
[{"$f":"VLOOKUP('Input and Output'!$C$29,Lin_parameters_wknd!$A$2:$F$7,1,FALSE)","v":3},{"$f":"VLOOKUP('Input and Output'!$C$29,Lin_parameters_wknd!$A$2:$F$7,2,FALSE)","v":1.31124751273035},{"$f":"VLOOKUP('Input and Output'!$C$29,Lin_parameters_wknd!$A$2:$F$7,3,FALSE)","v":-7.5310765362349638E-2},{"$f":"VLOOKUP('Input and Output'!$C$29,Lin_parameters_wknd!$A$2:$F$7,4,FALSE)","v":0.29524473618599389},{"$f":"VLOOKUP('Input and Output'!$C$29,Lin_parameters_wknd!$A$2:$F$7,5,FALSE)","v":-9.762199133681506E-3},{"$f":"VLOOKUP('Input and Output'!$C$29,Lin_parameters_wknd!$A$2:$F$7,6,FALSE)","v":15.5}]